Build failed in MessagingSubsystem30TestCase

classic Classic list List threaded Threaded
2 messages Options
Reply | Threaded
Open this post in threaded view
|

Build failed in MessagingSubsystem30TestCase

gathila harischandra

Hi all,

I ‘m trying to run build.bat and this build failure occurred test set org.jboss.as.messaging.test.MessagingSubsystem30TestCase

 

java.lang.RuntimeException: org.eclipse.aether.resolution.ArtifactResolutionException: Could not transfer artifact org.jboss.as:jboss-as-messaging:jar:7.3.0.Final-redhat-14 from/to product-repository


_______________________________________________
wildfly-dev mailing list
[hidden email]
https://lists.jboss.org/mailman/listinfo/wildfly-dev
Reply | Threaded
Open this post in threaded view
|

Re: Build failed in MessagingSubsystem30TestCase

Eduardo Sant´Ana da Silva
Try mvn clean install -U  instead.


2016-02-21 3:00 GMT-03:00 gathila harischandra <[hidden email]>:

Hi all,

I ‘m trying to run build.bat and this build failure occurred test set org.jboss.as.messaging.test.MessagingSubsystem30TestCase

 

java.lang.RuntimeException: org.eclipse.aether.resolution.ArtifactResolutionException: Could not transfer artifact org.jboss.as:jboss-as-messaging:jar:7.3.0.Final-redhat-14 from/to product-repository


_______________________________________________
wildfly-dev mailing list
[hidden email]
https://lists.jboss.org/mailman/listinfo/wildfly-dev



--
__________________________
Eduardo Sant'Ana da Silva - Dr.
Pesquisador / Consultor de TI


_______________________________________________
wildfly-dev mailing list
[hidden email]
https://lists.jboss.org/mailman/listinfo/wildfly-dev